{"text_format":"2","workbook":"xlsx","n_sheets":5,"sheets":["NV có CCHN BVĐKTPCT 10.2023","NV ĐÃ NGHĨ 10.2023","DS NVBV chưa có CCHN 10.2023","DS ĐĂNG KÝ NGƯỜI LÀM VIỆC 10 ","DS HỌC VIÊN THỰC HÀNH CCHN"],"not_rendered":{"charts":0,"images":0,"macros":0,"external_links":2,"defined_names":4,"comments":0,"pivot_tables":0},"unopened":[],"bounds":{"document_bytes":16777216,"sheet_cells":100000,"run_cost":"one","rows_first":2000,"rows_last":500,"rows_between":2000,"halvings":0,"cell_chars":16384,"cell_head_chars":4096},"cells_cut":0,"cells_raw":0,"read":"whole","date_system":"1900"}

{"sheet":"NV có CCHN BVĐKTPCT 10.2023","index":0,"n_rows":767,"n_cols":9,"rows_kept":767,"cut":false,"hidden":false,"merged":[[4,2,4,7],[5,2,5,7],[6,1,6,8],[13,4,13,6],[766,6,766,7],[1,0,1,2],[1,4,1,8],[2,0,2,2],[2,4,2,8],[3,4,3,8]]}
[]
[" SỞ Y TẾ TP.CẦN THƠ",null,null,null,"CỘNG HÒA XÃ HỘI CHỦ NGHĨA VIỆT NAM"]
["BỆNH VIỆN ĐA KHOA TP.CẦN THƠ",null,null,null,"                       Độc lập - Tự do - Hạnh phúc"]
[{"$nulls":4},"Cần Thơ, ngày    tháng     năm 2023"]
[null,null,"DANH SÁCH"]
[null,null,"         Đăng ký hành nghề tại cơ sở khám bệnh, chữa bệnh"]
[null," (đến tháng 20/10/2023)"]
[]
["1. Tên cơ sở khám bệnh, chữa bệnh: Bệnh viện Đa khoa thành phố Cần Thơ"]
["2. Địa chỉ: số 04 đường Châu Văn Liêm, phường An Lạc, quận Ninh Kiều, thành phố Cần Thơ"]
["3. Thời gian hoạt động của cơ sở khám, chữa bệnh: 24/24"]
["4.1 Danh sách nhân viên đã có CCHN"]
[]
["STT","Họ và tên","Số CCHN\nđã được cấp","Phạm vi hoạt động chuyên môn","Thời gian đăng ký làm việc\ntại cơ sở khám bệnh, chữa bệnh\n(ghi cụ thể thời gian làm việc)",null,null,"Học vị","Chức vụ"]
[{"$nulls":4},"Thời gian\nđăng ký ","Thời gian\n(ngày)","Thời gian\n(giờ)"]
["1","Trần Quốc Luận","000813/CT-CCHN","Khám bệnh, chữa bệnh chuyên khoa Nội","Toàn thời gian",null,"07h00 - 11h00; 13h00 - 17h00","BSCKII","Giám đốc"]
["2","Huỳnh Minh Phú","000797/CT-CCHN","Khám, chữa bệnh chuyên khoa Chẩn đoán hình ảnh","Toàn thời gian",null,"07h00 - 11h00; 13h00 - 17h00","BSCKII","Phó Giám đốc"]
["3","Phạm Văn Phương","000518/CT-CCHN","Khám, chữa bệnh chuyên khoa Ngoại","Toàn thời gian",null,"07h00 - 11h00; 13h00 - 17h00","BSCKII","Phó Giám đốc"]
["4","Trần Dạ Thảo","000841/CT-CCHN","Khám bệnh, chữa bệnh chuyên khoa Nội","Toàn thời gian",null,"07h00 - 11h00; 13h00 - 17h00","BSCKII","Phó Giám đốc"]
["5","Phạm Thị Ngọc Thúy","000512/CT-CCHN","Khám, chữa bệnh chuyên khoa Nội","Toàn thời gian",null,"07h00 - 11h00; 13h00 - 17h00","BSCKII"," Phó\nTrưởng phòng"]
["6","Trần Thanh Khoa","003786/CT-CCHN","Khám bệnh, chữa bệnh Nội khoa\nKhám bệnh, chữa bệnh Da liễu","Toàn thời gian",null,"07h00 - 11h00; 13h00 - 17h00","BSCKI"," Phó\nTrưởng phòng"]
["7","Quách Thị Sáu","1082/CCHN-D-SYT-CT","Bán buôn thuốc, nguyên liệu làm thuốc; Bán lẻ thuốc.\nChịu trách nhiệm chuyên môn về dược của cơ sở: Bán buôn thuốc, nguyên liệu làm thuốc (trừ vắc xin, sinh phẩm, dược liệu), thuốc dược liệu, thuốc cổ truyền; Nhà thuốc; Quầy thuốc; Tủ thuốc Trạm y tế.","Toàn thời gian",null,"07h00 - 11h00; 13h00 - 17h00","DSĐH"]
["8","Trương Thị Bích Ngân","611/CCHN-D-SYT-CT","Bảo quản; bán thuốc, nguyên liệu làm thuốc\nChiệu trách nhiệm chuyên môn về dược của cơ sở: Kinh doanh dịch vụ bảo quản; bán buôn thuốc, nguyên liệu làm thuốc (trừ vắc xin, sinh phẩm), dược liệu, thuốc dược liệu, thuốc cổ truyền; nhà thuốc; quầy thuốc; tủ thuốc Trạm Y tế.","Toàn thời gian",null,"07h00 - 11h00; 13h00 - 17h00","DSĐH/\nCKI Dược lý &DLS"]
["9","Thạch Bảo Châu","126/CCHN-D-SYT-CT","Bán lẻ thuốc (người chịu trách nhiệm chuyên môn về Dược của quầy thuốc )","Toàn thời gian",null,"07h00 - 11h00; 13h00 - 17h00","ThS Dược"]
["10","Nguyễn Thanh Mỹ Dị","003171/CT-CCHN","Thực hiện các kỹ thuật điều dưỡng cơ bản","Toàn thời gian",null,"07h00 - 11h00; 13h00 - 17h00","CNĐD"]
["11","Thị Mỹ Lan","004052/CT-CCHN","Thực hiện các kỹ thuật điều dưỡng cơ bản và các kỹ thuật điều dưỡng chuyên khoa","Toàn thời gian",null,"07h00 - 11h00; 13h00 - 17h00","CNĐD"]
["12","Nguyễn Phương Dung","005098/CT-CCHN","Thực hiện theo chức năng nhiệm vụ của Điều dưỡng quy định tại Thông tư liên tịch số 26/2015/TTLT-BYT-BNV ngày 07/10/2015.","Toàn thời gian",null,"07h00 - 11h00; 13h00 - 17h00","CNĐD"]
["13","Nguyễn Thị Thùy Dung","004762/CT-CCHN","Thực hiện theo chức năng nhiệm vụ của Điều dưỡng quy định tại Thông tư liên tịch số 26/2015/TTLT-BYT-BNV ngày 07/10/2015.","Toàn thời gian",null,"07h00 - 11h00; 13h00 - 17h00","ĐDTC/ ĐDCĐ"]
["14","Nguyễn Thị Dịu Hương","632/CCHN-D-SYT-CT","Bán lẻ thuốc (người chịu trách nhiệm chuyên môn về Dược của quầy thuốc )","Toàn thời gian",null,"07h00 - 11h00; 13h00 - 17h00","DSTH"]
["15","Nguyễn Thị Thúy Nhiệm","003068/CT-CCHN","Thực hiện các kỹ thuật điều dưỡng cơ bản","Toàn thời gian",null,"07h00 - 11h00; 13h00 - 17h00","CNĐD"]
["16","Nguyễn Thị Ngọc Bích","006513/CT-CCHN","Thực hiện theo chức năng nhiệm vụ của Điều dưỡng quy định tại Thông tư liên tịch số 26/2015/TTLT-BYT-BNV ngày 07/10/2015.","Toàn thời gian",null,"07h00 - 11h00; 13h00 - 17h00","CNĐD"]
["17","Lâm Hữu Đức","002891/CT-CCHN",{"$f":"VLOOKUP(B32,'[1]ĐÃ có CCHN'!$B$3:$I$889,4,FALSE)","v":"Thực hiện các kỹ thuật điều dưỡng cơ bản và các kỹ thuật điều dưỡng chuyên khoa"},"Toàn thời gian",null,"07h00 - 11h00; 13h00 - 17h00","ĐDCKI","Trưởng phòng"]
["18","Nguyễn Thị Thanh Xuân","002994/CT-CCHN",{"$f":"VLOOKUP(B33,'[1]ĐÃ có CCHN'!$B$3:$I$889,4,FALSE)","v":"Thực hiện các kỹ thuật điều dưỡng cơ bản và các kỹ thuật điều dưỡng chuyên khoa"},"Toàn thời gian",null,"07h00 - 11h00; 13h00 - 17h00","ĐDCKI"," Phó\nTrưởng phòng"]
["19","Nguyễn Văn Thắng","003131/CT-CCHN","Thực hiện các kỹ thuật điều dưỡng cơ bản","Toàn thời gian",null,"07h00 - 11h00; 13h00 - 17h00","ĐDCKI"]
["20","Lê Diệu Hiền","601/CT-CCHND","Sản xuất, xuất khẩu, nhập khẩu, bán buôn, bán lẻ, dịch vụ bảo quản, dịch vụ kiểm nghiệm thuốc","Toàn thời gian",null,"07h00 - 11h00; 13h00 - 17h00","DSCKII"]
["21","Trần Thanh Trí","003002/CT-CCHN",{"$f":"VLOOKUP(B36,'[1]ĐÃ có CCHN'!$B$3:$I$889,4,FALSE)","v":"Thực hiện các kỹ thuật điều dưỡng cơ bản và các kỹ thuật điều dưỡng chuyên khoa"},"Toàn thời gian",null,"07h00 - 11h00; 13h00 - 17h00","ĐDCKI"," Phó\nTrưởng phòng"]
["22","Nguyễn Trung Hiếu","004048/CT-CCHN",{"$f":"VLOOKUP(B37,'[1]ĐÃ có CCHN'!$B$3:$I$889,4,FALSE)","v":"- Khám bệnh, chữa bệnh chuyên khoa ngoại, bỏng\n- Khám bệnh, chữa bệnh chuyên khoa phẫu thuật tạo hình"},"Toàn thời gian",null,"07h00 - 11h00; 13h00 - 17h00","Thạc sĩ Bác sĩ"]
["23","Huỳnh Văn Huấn","000558/CT-CCHN","Khám, chữa bệnh chuyên khoa Ngoại - Chấn thương chỉnh hình","Toàn thời gian",null,"07h00 - 11h00; 13h00 - 17h00","BSCKII","Trưởng phòng"]
["24","Nguyễn Thị Thúy An","003224/CT-CCHN","Thực hiện các kỹ thuật điều dưỡng cơ bản","Toàn thời gian",null,"07h00 - 11h00; 13h00 - 17h00","CNĐD"]
["25","Huỳnh Huyền Trân","005829/CT-CCHN","Thực hiện theo chúc năng nhiệm vụ của điều dưỡng quy định theo Thông tư liên tịch số 26/2015/TTLT-BYT ngày 07/10/2015","Toàn thời gian",null,"07h00 - 11h00; 13h00 - 17h00","CNĐD"]
{"$rows_left_out":728}
{"sheet":"NV ĐÃ NGHĨ 10.2023","index":1,"n_rows":1048574,"n_cols":8,"rows_kept":1048574,"cut":false,"hidden":false,"merged":[[9,3,9,5],[4,0,4,6],[5,0,5,7],[9,0,10,0],[9,1,10,1],[9,2,10,2],[9,6,10,6],[9,7,10,7],[1,0,1,2],[1,3,1,6],[2,0,2,2],[2,3,2,6],[3,3,3,6]]}
[]
[" SỞ Y TẾ TP.CẦN THƠ",null,null,"CỘNG HÒA XÃ HỘI CHỦ NGHĨA VIỆT NAM"]
["BỆNH VIỆN ĐA KHOA TP.CẦN THƠ",null,null,"                       Độc lập - Tự do - Hạnh phúc"]
[null,null,null,"Cần Thơ, ngày    tháng     năm 2023"]
["DANH SÁCH NVYT ĐÃ NGHĨ VIỆC/HƯU"]
[" (từ 01/2023 đến tháng 20/10/2023)"]
[]
["4.3 Danh sách NVYT đã nghĩ việc/nghĩ hưu"]
[]
["STT","Họ và tên","Số CCHN\nđã được cấp","Thời gian đăng ký làm việc\ntại cơ sở khám bệnh, chữa bệnh\n(ghi cụ thể thời gian làm việc)",null,null,"Chức danh","Ngày nghĩ việc/hưu"]
[null,null,null,"Thời gian\nđăng ký ","Thời gian\n(ngày)","Thời gian\n(giờ)"]
[1,"Hàn Khánh Như",{"$f":"VLOOKUP(B12,[2]Sheet!$F$2:$G$771,2,0)","v":"005822/CT-CCHN"},"Toàn thời gian",null,"07h00 - 11h00; 13h00 - 17h00","ĐDCĐ","2023-01-01"]
[2,"Lê Đình Minh Hải",null,"Toàn thời gian",null,"07h00 - 11h00; 13h00 - 17h00","ĐDCĐ","2023-01-01"]
[3,"Nguyễn Thị Ngọc Hân",{"$f":"VLOOKUP(B14,[2]Sheet!$F$2:$G$771,2,0)","v":"004280/CT-CCHN"},"Toàn thời gian",null,"07h00 - 11h00; 13h00 - 17h00","DSTH","2023-02-01"]
[4,"Huỳnh Vĩnh An",{"$f":"VLOOKUP(B15,[2]Sheet!$F$2:$G$771,2,0)","v":"006937/CT-CCHN"},"Toàn thời gian",null,"07h00 - 11h00; 13h00 - 17h00","Bác sĩ","2023-02-01"]
[5,"Vũ Thanh Hồng Vân",{"$f":"VLOOKUP(B16,[2]Sheet!$F$2:$G$771,2,0)","v":"005588/AG-CCHN"},"Toàn thời gian",null,"07h00 - 11h00; 13h00 - 17h00","Bác sĩ","2023-02-01"]
[6,"Nguyễn Phạm Ái Phương",{"$f":"VLOOKUP(B17,[2]Sheet!$F$2:$G$771,2,0)","v":"005925/CT-CCHN"},"Toàn thời gian",null,"07h00 - 11h00; 13h00 - 17h00","Bác sĩ","2023-02-01"]
[7,"Từ Mậu Xương",{"$f":"VLOOKUP(B18,[2]Sheet!$F$2:$G$771,2,0)","v":"006800/CT-CCHN"},"Toàn thời gian",null,"07h00 - 11h00; 13h00 - 17h00","Bác sĩ","2023-03-01"]
[8,"Đào Quốc Toàn",null,"Toàn thời gian",null,"07h00 - 11h00; 13h00 - 17h00","CNĐD","2023-03-01"]
[9,"Nguyễn Ngọc Anh Thư",{"$f":"VLOOKUP(B20,[2]Sheet!$F$2:$G$771,2,0)","v":"004497/CT-CCHN"},"Toàn thời gian",null,"07h00 - 11h00; 13h00 - 17h00","ĐDCĐ","2023-03-01"]
[10,"Khưu Hồng Anh",{"$f":"VLOOKUP(B21,[2]Sheet!$F$2:$G$771,2,0)","v":"007435/CT-CCHN"},"Toàn thời gian",null,"07h00 - 11h00; 13h00 - 17h00","Bác sĩ","2023-03-01"]
[11,"Võ Thế Nhiều",{"$f":"VLOOKUP(B22,[2]Sheet!$F$2:$G$771,2,0)","v":"003931/CT-CCHN"},"Toàn thời gian",null,"07h00 - 11h00; 13h00 - 17h00","Bác sĩ","2023-03-08"]
[12,"Nguyễn Thị Kim Lê",{"$f":"VLOOKUP(B23,[2]Sheet!$F$2:$G$771,2,0)","v":"005099/CT-CCHN"},"Toàn thời gian",null,"07h00 - 11h00; 13h00 - 17h00","CNĐD","2023-04-01"]
[13,"Phạm Thị Kim Dung",{"$f":"VLOOKUP(B24,[2]Sheet!$F$2:$G$771,2,0)","v":"003141/CT-CCHN"},"Toàn thời gian",null,"07h00 - 11h00; 13h00 - 17h00","CNĐD","2023-04-01"]
[14,"lê Thanh Nguyên",{"$f":"VLOOKUP(B25,[2]Sheet!$F$2:$G$771,2,0)","v":"005078/CT-CCHN"},"Toàn thời gian",null,"07h00 - 11h00; 13h00 - 17h00","CNĐD","2023-04-01"]
[15,"Trần Thị Bích Thuận",{"$f":"VLOOKUP(B26,[2]Sheet!$F$2:$G$771,2,0)","v":"002904/CT-CCHN"},"Toàn thời gian",null,"07h00 - 11h00; 13h00 - 17h00","ĐDCĐ","2023-04-01"]
[16,"Nguyễn Thị Diễm Hương","006061/CT-CCHN","Toàn thời gian",null,"07h00 - 11h00; 13h00 - 17h00","CNĐD","2023-04-01"]
[17,"Lâm Thị Cẩm Hường",{"$f":"VLOOKUP(B28,[2]Sheet!$F$2:$G$771,2,0)","v":"004733/CT-CCHN"},"Toàn thời gian",null,"07h00 - 11h00; 13h00 - 17h00","ĐDCĐ","2023-04-01"]
[18,"Đỗ Đức Trí Nhân",{"$f":"VLOOKUP(B29,[2]Sheet!$F$2:$G$771,2,0)","v":"004071/CT-CCHN"},"Toàn thời gian",null,"07h00 - 11h00; 13h00 - 17h00","ThsBs","2023-04-17"]
[19,"Trần Hà Quốc Đạt",{"$f":"VLOOKUP(B30,[2]Sheet!$F$2:$G$771,2,0)","v":"006488/CT-CCHN"},"Toàn thời gian",null,"07h00 - 11h00; 13h00 - 17h00","Bác sĩ","2023-04-14"]
[20,"Trần Thanh Loan",null,"Toàn thời gian",null,"07h00 - 11h00; 13h00 - 17h00","Th TCNH","2023-04-14"]
[21,"Trần Bửu Giám",{"$f":"VLOOKUP(B32,[2]Sheet!$F$2:$G$771,2,0)","v":"001115/CT-CCHN"},"Toàn thời gian",null,"07h00 - 11h00; 13h00 - 17h00","BSCKII","2023-05-01"]
[22,"Bùi Quang Huy",{"$f":"VLOOKUP(B33,[2]Sheet!$F$2:$G$771,2,0)","v":"006400/CT-CCHN"},"Toàn thời gian",null,"07h00 - 11h00; 13h00 - 17h00","Bác sĩ","2023-05-08"]
[23,"Nguyễn Phú Quý",null,"Toàn thời gian",null,"07h00 - 11h00; 13h00 - 17h00","KSXD","2023-05-06"]
[24,"Bùi Như Quỳnh",null,"Toàn thời gian",null,"07h00 - 11h00; 13h00 - 17h00","Bác sĩ","2023-05-10"]
[25,"Du Kim Tuyến",null,"Toàn thời gian",null,"07h00 - 11h00; 13h00 - 17h00","ĐDCĐ","2023-05-15"]
[26,"Lê Hoàng Nam",null,"Toàn thời gian",null,"07h00 - 11h00; 13h00 - 17h00","BSCKI ","2023-05-15"]
[27,"Trần Thị Thảo Linh",{"$f":"VLOOKUP(B38,[2]Sheet!$F$2:$G$771,2,0)","v":"003740/CT-CCHN"},"Toàn thời gian",null,"07h00 - 11h00; 13h00 - 17h00","BSCKI ","2023-06-05"]
[28,"Nguyễn Huỳnh Quang Huy",{"$f":"VLOOKUP(B39,[2]Sheet!$F$2:$G$771,2,0)","v":"003169/CT-CCHN"},"Toàn thời gian",null,"07h00 - 11h00; 13h00 - 17h00","BSCKI ","2023-06-13"]
[29,"Cao Thị Huỳnh Hoa",{"$f":"VLOOKUP(B40,[2]Sheet!$F$2:$G$771,2,0)","v":"002949/CT-CCHN"},"Toàn thời gian",null,"07h00 - 11h00; 13h00 - 17h00","CNĐD","2023-06-19"]
{"$rows_left_out":37}
{"sheet":"DS NVBV chưa có CCHN 10.2023","index":2,"n_rows":98,"n_cols":13,"rows_kept":98,"cut":false,"hidden":false,"merged":[[0,0,0,2],[1,0,1,2],[0,4,0,5],[1,4,1,5],[6,0,6,6],[7,0,7,12],[8,7,8,12],[2,4,2,5],[97,3,97,4],[97,6,97,7]]}
[" SỞ Y TẾ TP.CẦN THƠ",null,null,null,"CỘNG HÒA XÃ HỘI CHỦ NGHĨA VIỆT NAM"]
["BỆNH VIỆN ĐA KHOA TP.CẦN THƠ",null,null,null,"                       Độc lập - Tự do - Hạnh phúc"]
[{"$nulls":4},"Cần Thơ, ngày    tháng     năm 2023"]
[]
["4.2 Danh sách nhân viên đã chưa có CCHN"]
[]
["DANH SÁCH NHÂN VIÊN CHƯA CÓ CCHN TẠI BỆNH VIỆN ĐA KHOA THÀNH PHỐ "]
[" (đến tháng 20/10/2023)"]
["TT","Họ và tên ","Văn bằng chuyên môn","Số \nhợp đồng","Khoa/ Phòng","Dự kiến phạm vi cấp CCHN","Người hướng dẫn thực hành","Thời gian thực hành"]
[1,"Nguyễn Quốc Thể","Bác sĩ",48,"HỒI SỨC CẤP CỨU","Đáp ứng KCB chuyên khoa Nội","ThsBS Lê Thị Cẩm Hồng","2021-08-01"]
[{"$f":"A10+1","v":2},"Phạm Nguyễn Ngọc Thảo","Bác sĩ",31,"HỒI SỨC CẤP CỨU","Đáp ứng KCB chuyên khoa Nội","ThsBS Lê Thị Cẩm Hồng"]
[{"$f":"A11+1","v":3},"Lê Thị Thúy Huỳnh","Bác sĩ",32,"HỒI SỨC CẤP CỨU","Đáp ứng KCB chuyên khoa Nội","ThsBS Lê Thị Cẩm Hồng"]
[4,"Trầm Hữu Lộc","Bác sĩ",168,"HỒI SỨC CẤP CỨU","Đáp ứng KCB chuyên khoa Nội","BSCKII Đặng Văn Hải"]
[5,"Nguyễn Lâm Phú","Bác sĩ",170,"HỒI SỨC CẤP CỨU","Đáp ứng KCB chuyên khoa Nội","BSCKI Trầm Thanh Thủy"]
[6,"Hoàng Tấn Đạt","ĐDCĐ",48,"HỒI SỨC CẤP CỨU","Đáp ứng nhu cầu chăm sóc người bệnh","CNĐD Nguyễn Minh Trí"]
[7,"Mân Lê Huy","CNĐD",284,"HỒI SỨC CẤP CỨU","Đáp ứng nhu cầu chăm sóc người bệnh","CNĐD Nguyễn Minh Trí"]
[8,"Nguyễn Phúc Lê Trí","ĐDCĐ ",46,"HỒI SỨC CẤP CỨU","Đáp ứng nhu cầu chăm sóc người bệnh","CNĐD Nguyễn Minh Trí","01/03/2019","2019-12-01",null,"X",null,"2019-12-01"]
[9,"Nguyễn Văn Rợi","CNĐD",163,"HỒI SỨC CẤP CỨU","Đáp ứng nhu cầu chăm sóc người bệnh","CNĐD Nguyễn Minh Trí","2022-01-01"]
[10,"Nguyễn Minh Triết","CNĐD",191,"HỒI SỨC CẤP CỨU","Đáp ứng nhu cầu chăm sóc người bệnh","CNĐD Nguyễn Minh Trí"]
[11,"Đặng Mỹ Tiên","ĐDCĐ",183,"HỒI SỨC CẤP CỨU","Đáp ứng nhu cầu chăm sóc người bệnh","CNĐD Nguyễn Minh Trí"]
[12,"Nguyễn Thanh Ngân","ĐDCĐ",40,"K.KB","Đáp ứng nhu cầu chăm sóc người bệnh","CNĐD Trần Thị Kim Hằng","2022-01-01"]
[13,"Phạm Huỳnh Bình Văn","ĐDCĐ",55,"K.KB","Đáp ứng nhu cầu chăm sóc người bệnh","CNĐD Trần Thị Kim Hằng"]
[14,"Lương Túc Vinh","Bác sĩ",77,"K. HSTC-CĐ","Đáp ứng KCB chuyên khoa Nội","BSCKII Nguyễn Thành Bích Thảo"]
[15,"Đào Anh Kiệt","Bác sĩ",105,"K. HSTC-CĐ","Đáp ứng KCB chuyên khoa Nội","BSCKII Nguyễn Thành Bích Thảo"]
[16,"Lê Hoàng Ân","Bác sĩ",164,"K. HSTC-CĐ","Đáp ứng KCB chuyên khoa Nội","BSCKII Lâm Phương Thúy"]
[17,"Châu Hoàng Thanh Vy","Bác sĩ",176,"K. HSTC-CĐ","Đáp ứng KCB chuyên khoa Nội","BSCKII Lâm Phương Thúy"]
[18,"Nguyễn Trần Kim Cương","CĐĐD",193,"K. HSTC-CĐ","Đáp ứng nhu cầu chăm sóc người bệnh","ĐDCKI Lương Thị Thanh Hoài","2022-01-01"]
[19,"Đoàn Như Ngọc","CĐĐD",55,"K. HSTC-CĐ","Đáp ứng nhu cầu chăm sóc người bệnh","CNĐD Lương Thị Thanh Hoài","2022-01-01"]
[20,"Bùi Thị Kiều Oanh","CĐĐD",33,"K. HSTC-CĐ","Đáp ứng nhu cầu chăm sóc người bệnh","CNĐD Lương Thị Thanh Hoài","2020-02-01","2021-08-01",null,null,null,"2020-02-01"]
[21,"Phạm Quốc Quy","Bác sĩ",145,"K. NỘI TH","Đáp ứng KCB chuyên khoa Nội","BSCKII Triệu Anh Đệ","01/10/2019","2020-07-01",null,"X",null,"2020-04-01"]
[22,"Trần Hữu Lợi","Bác sĩ",41,"K. NỘI TH","Đáp ứng KCB chuyên khoa Nội","BSCKII Triệu Anh Đệ","2021-03-01",{"$nulls":4},"2021-02-01"]
[23,"Nguyễn Thị Trà Mi","Bác sĩ",42,"K. NỘI TH","Đáp ứng KCB chuyên khoa Nội","BSCKII Triệu Anh Đệ"]
[24,"Lê Huỳnh Kim Khánh","Bác sĩ",47,"K. NỘI TH","Đáp ứng KCB chuyên khoa Nội","BSCKII Triệu Anh Đệ"]
[25,"Đỗ Trung Niên","Bác sĩ",172,"K. NỘI TH","Đáp ứng KCB chuyên khoa Nội","ThsBS Tống Vấn Thùy"]
[26,"Lê Thị Trang Thảo","Bác sĩ",173,"K. NỘI TH","Đáp ứng KCB chuyên khoa Nội","ThsBS Tống Vấn Thùy"]
[27,"Nguyễn Nhật Khánh","CNĐD",41,"K. NỘI TH","Đáp ứng nhu cầu chăm sóc người bệnh","CNĐD Từ Thị Ngọc Huệ","2021-08-01"]
[28,"Nguyễn Hà Trúc Giang","Bác sĩ",144,"K. NỘI TM-LH","Đáp ứng KCB chuyên khoa Nội","ThsBS Lê Văn Cường"]
[29,"Dư Kim Giàu","Bác sĩ",107,"K. NỘI TM-LH","Đáp ứng KCB chuyên khoa Nội","BSCKII Võ Việt Thắng"]
[30,"Nguyễn Thị Ánh Kim","ĐDCĐ",147,"K. NỘI TM-LH","Đáp ứng nhu cầu chăm sóc người bệnh","ĐDCKI Nguyễn Thị Ngọc Hài","2022-01-01"]
[31,"Phan Phạm Trường Nhựt","ĐDCĐ",149,"K. NỘI TM-LH","Đáp ứng nhu cầu chăm sóc người bệnh","ĐDCKI Nguyễn Thị Ngọc Hài","2021-08-01"]
{"$rows_left_out":59}
{"sheet":"DS ĐĂNG KÝ NGƯỜI LÀM VIỆC 10 ","index":3,"n_rows":126,"n_cols":5,"rows_kept":126,"cut":false,"hidden":false,"merged":[[4,1,4,4],[5,1,5,4],[6,1,6,4],[8,0,8,4],[1,0,1,2],[1,3,1,4],[2,0,2,2],[2,3,2,4],[3,3,3,4]]}
[]
[" SỞ Y TẾ TP.CẦN THƠ",null,null,"CỘNG HÒA XÃ HỘI CHỦ NGHĨA VIỆT NAM"]
["BỆNH VIỆN ĐA KHOA TP.CẦN THƠ",null,null,"                       Độc lập - Tự do - Hạnh phúc"]
[null,null,null,"Cần Thơ, ngày    tháng     năm 2023"]
[null,"DANH SÁCH"]
[null,"         Đăng ký người làm việc (không thuộc diện cấp chứng chỉ hành nghề)"]
[null," (đến tháng 20/10/2023)"]
[]
["5. Danh sách  đăng ký người làm việc (không thuộc diện cấp chứng chỉ hành nghề)"]
[]
["STT","Họ và tên","Văn bằng chuyên môn","Thời gian đăng ký làm việc\ntại cơ sở khám bệnh, chữa bệnh\n(ghi cụ thể thời gian làm việc)","Vị trí làm việc"]
[1,"Bùi Hoàng Minh","KS tin học","Toàn thời gian","P. KHTH"]
[{"$f":"A12+1","v":2},"Võ Thúy Huỳnh","KS tin học","Toàn thời gian","P. KHTH"]
[3,"Nguyễn Hữu Hạ","KS KTĐT,TT","Toàn thời gian","P. KHTH"]
[2,"Nguyễn Văn Hùng","Ths Khoa học máy tính","Toàn thời gian","P. KHTH"]
[3,"Phạm Thanh Đồng","KS HTTT","Toàn thời gian","P. KHTH"]
[4,"Lý Trí Hoa","KS Công nghệ thông tin","Toàn thời gian","P. KHTH"]
[3,"Nguyễn Thanh Liêm","KS Công nghệ phần mềm","Toàn thời gian","P. KHTH"]
[4,"Trần Đường Trúc Thanh","KS KTPM","Toàn thời gian","P. KHTH"]
[5,"Trịnh Hoàng Nhựt","KS MTT & TT","Toàn thời gian","P. KHTH"]
[4,"Huỳnh Xuân Trường","KS KT Máy tính","Toàn thời gian","P. KHTH"]
[5,"Nguyễn Minh Triết","KS KH Máy tính","Toàn thời gian","P. KHTH"]
[6,"Nguyễn Bá Nhanh","NVPV/ Y Sĩ","Toàn thời gian","P. KHTH"]
[5,"Trịnh Hồng Tỏ","CN QTKD","Toàn thời gian","P. TCCB (PTP)"]
[6,"Trần Ngọc Lan Thảo","CN kế toán","Toàn thời gian","P. TCCB (PTP)"]
[7,"Trần Hà Thanh Trúc","CN Anh Văn/ CN QTKD","Toàn thời gian","P. TCCB"]
[6,"Dương Lê Thị Hạnh Nguyên","CNKT","Toàn thời gian","P. CTXH"]
[7,"Lê Thị Bé Trang","CN QTKD","Toàn thời gian","P. TCCB"]
[8,"Nguyễn Hoàng Tươi","CN Luật","Toàn thời gian","P. HCQT (PTP -PT)"]
[7,"Lưu Mạnh Hùng","KS xây dựng","Toàn thời gian","P. HCQT (PTP)"]
[8,"Nguyễn Thị Trúc Linh","Thạc sĩ Q/lý k/tế","Toàn thời gian","P. HCQT"]
[9,"Lê Trung Hậu","KS Điện KH & CC điện","Toàn thời gian","P. HCQT"]
[8,"Nguyễn Thị Thúy Uyên","CN Kinh tế ","Toàn thời gian","P. HCQT\n(cơ sở 2)"]
[9,"Trần Thanh Phong","Ths QTKD","Toàn thời gian","P. HCQT"]
[10,"Phạm Quang Chín","CNKT","Toàn thời gian","P. HCQT"]
[9,"Lê Ngọc Thanh","Lái xe","Toàn thời gian","P. HCQT"]
[10,"Lê Thanh Hải","NVPV","Toàn thời gian","P. HCQT"]
[11,"Phạm Hoàng Tài","NVKT","Toàn thời gian","P. HCQT"]
[10,"Lê Phước Tăng","KS ĐKH-CCĐ","Toàn thời gian","P. HCQT"]
[11,"Lâm Danh Lê Quyền","KS Cảnh quan","Toàn thời gian","P. HCQT"]
{"$rows_left_out":87}
{"sheet":"DS HỌC VIÊN THỰC HÀNH CCHN","index":4,"n_rows":53,"n_cols":12,"rows_kept":53,"cut":false,"hidden":false,"merged":[[0,1,0,3],[1,1,1,3],[2,1,2,2],[0,4,0,10],[1,4,1,10],[2,4,2,10],[3,0,3,6],[7,0,8,0],[7,1,8,1],[7,2,8,2],[7,3,8,3],[7,4,8,4],[7,5,8,5],[7,6,7,8],[5,0,5,11],[6,0,6,10],[52,9,52,10],[52,3,52,5],[7,9,8,9],[7,10,8,10],[7,11,8,11]]}
[null," SỞ Y TẾ TP.CẦN THƠ",null,null,"CỘNG HÒA XÃ HỘI CHỦ NGHĨA VIỆT NAM"]
[null,"BỆNH VIỆN ĐA KHOA TP.CẦN THƠ",null,null,"                       Độc lập - Tự do - Hạnh phúc"]
[{"$nulls":4},"Cần Thơ, ngày    tháng     năm 2023"]
[]
[]
["DANH SÁCH HỌC VIÊN ĐANG THỰC HÀNH TẠI BỆNH VIỆN ĐỂ ĐỦ ĐIỀU KIỆN CẤP CHỨNG CHỈ HÀNH NGHỀ"]
[" TẠI THỜI ĐIỂM 20/10/2023"]
["TT","Họ và tên ","Ngày sinh","Văn bằng chuyên môn","Số \nhợp đồng","Dự kiến phạm vi cấp CCHN","Thời gian thực hành",null,null,"Khoa thực hành","Người hướng dẫn","Ghi chú"]
[{"$nulls":6},"Từ ngày","đến ngày","Gia hạn HĐ"]
[1,"Nguyễn Tấn Sang","1997-10-01","BS RHM","158/HD","RMH","2023-02-13","2024-08-12",null," RHM","T.K.Hoa"]
[2,"Nguyễn Trung Hậu","1997-10-04","BS RHM","157/HĐ","RMH","2023-02-13","2024-08-12",null," RHM","N.N.Sáng"]
[3,"Lê Cao Tầng","1998-07-25","BS RHM","155/HĐ","RMH","2023-02-13","2024-08-12",null," RHM","T.T.Dân"]
[4,"Trầm Hữu Lộc","1997-02-03","BSĐK","277/HĐ","Nội Khoa","2023-03-01","2024-08-01",null,"Nội Khoa"]
[5,"Huỳnh Thị Thanh Uyên","2000-10-17","CNXN","333/HĐ","Xét nghiệm","2023-03-06","2023-12-05",null,"Xét nghiệm","T.T. Tường Vy"]
[6,"Võ Thị Huyền Trân","2001-07-05","CĐXN","363/HĐ","Xét nghiệm","2023-03-13","2023-12-12",null,"Xét nghiệm","N.T Oanh"]
[7,"Huỳnh Văn PHát Huy","2000-08-25","CNXN","248/HĐ","Xét nghiệm","2023-03-13","2023-12-12",null,"Xét nghiệm","Hà Minh Tuấn"]
[8,"Phan Thị Kiều Anh","2000-04-28","CĐXN","390/HĐ","Xét nghiệm","2023-03-20","2023-12-19",null,"Xét nghiệm","Hoàng Mai"]
[9,"Nguyễn Anh Duy","2001-12-31","CĐXN","383/HĐ","Xét nghiệm","2023-03-20","2023-12-19",null,"Xét nghiệm","L.M.Vương"]
[10,"Phạm Thị Hoa Nhi","2001-03-27","CĐĐD","409/HD","điều dưỡng","2023-03-23","2023-12-22",null,"HSTC-CĐ","L.T.T.Hoài"]
[11,"Võ Kim Phụng","2000-09-06","CNXN","565/hđ","Xét nghiệm","2023-04-19","2024-01-18",null,"Xét nghiệm","T.T. Tường Vy"]
[12,"Đặng Thị Hiền","2001-10-21","dd","566/HĐ","điều dưỡng","2023-04-20","2023-01-19",null,"nội tổng hợp","thanh thảo"]
[13,"Pang Tiêng K'Nhũy","1997-08-20","BS RHM","586/HĐ","RMH","2023-04-26","2024-10-25",null," RHM","B.A.Nhi"]
[14,"Phan Lưu Kim PHụng","1997-09-15","BS RHM","576/HĐ","RMH","2023-04-26","2024-10-25",null," RHM","B.A.Nhi"]
[15,"Lê Thái Cường","1996-04-05","BSĐK","658/HĐ","Nội Khoa","2023-05-15","2024-11-14",null,"Nội Khoa"]
[16,"Đỗ Trung Niên","1996-01-02","BSĐK","653/HĐ","Nội Khoa","2023-05-15","2024-11-14",null,"Nội Khoa"]
[17,"NGuyễn Thị My","2000-10-13","CNXN","544/HĐ","Xét nghiệm","2023-05-15","2024-02-14",null,"Xét nghiệm","N.M.Trang"]
[18,"Nguyễn Thị Bích Nga","1999-10-27","CNXN","567/HĐ","Xét nghiệm","2023-05-22","2024-02-21",null,"Xét nghiệm","L.H.H.Anh"]
[19,"Nguyễn Thanh Bình","1996-04-10","BSĐK","807/HD","đa khoa","2023-05-29","2024-04-28",null,"đa khoa",null,"BV Phụ Sản"]
[20,"Nguyễn Thị PHương Thảo","1990-11-23","BSĐK","784/HD","đa khoa","2023-05-29","2024-04-28",null,"đa khoa",null,"BV Phụ Sản"]
[21,"Nguyễn Trọng Nhân","1997-09-13","BSĐK","783/HĐ","đa khoa","2023-05-29","2024-04-28",null,"đa khoa",null,"BV Phụ Sản"]
[22,"Trần Thị Kim Trang","1987-04-02","TCYHCT","915/HĐ","YHCT","2023-06-22","22/06/204",null,"YHCT-PHCN","T.T.Loan"]
[23,"Đoàn Huỳnh Phú Duy","1996-05-24","TCYHCT","914/HĐ","YHCT","2023-06-22","2024-06-22",null,"YHCT-PHCN","T.T.Loan"]
[24,"HỒng Kim Tuyến","1996-03-15","BSYHCT","659/HĐ","YHCT","2023-06-22","2024-12-22",null,"YHCT-PHCN","T.T.Loan","BV Nhi Đồng"]
[25," Huỳnh Ngọc Quyên","2000-08-14","CĐXN","942/HĐ","điều dưỡng","2023-06-28","2023-03-27",null,"Nội thận","N.K.Sơn"]
[26,"Bùi Ngọc Trân","1999-10-17","CNXN","941/HĐ","Xét nghiệm","2023-06-28","2023-03-27",null,"Xét nghiệm","N.M.Trang"]
[27,"Nguyễn Hoàn Huy","1997-03-14","BSĐK","1057/HĐ","đa khoa","2023-07-21","2024-06-20",null,"đa khoa",null,"BV Phụ Sản"]
[28,"Mai Bảo Trân","1992-05-17","BSĐK","1094/HĐ","Nội Khoa","2023-07-28","2025-01-27",null,"Nội Khoa"]
[29,"Nguyễn Lý Khả Kỳ","2000-05-09","CNXN","1235/HĐ","Xét Nghiệm ","2023-08-28","2024-05-27",null,"Xét nghiệm","Nguyễn Thị Oanh "]
[30,"Ngô Hà Quốc Minh ","1999-12-30","BSĐK",null,"Nội Khoa","2023-09-11","2025-03-10",null," RHM","Trần Thị Kiều Hoa "]
[31,"Phạm Thị Thảo Nguyên","1996-05-18","BS RHM",null,"RMH","2023-09-18","2025-03-14",null," RHM","Trần Thị Kiều Hoa "]
{"$rows_left_out":13}